{"text_format":"1","workbook":"xlsx","n_sheets":10,"sheets":["Instructions","2-Wheelers TCO Dashboard","Summary","Currency","Capital Cost","Financing","Operational Cost","TCO_1","References","Tech. Specs."],"not_rendered":{"charts":5,"images":13,"macros":1,"external_links":0,"defined_names":0,"comments":0,"pivot_tables":0},"unopened":[],"bounds":{"document_bytes":16777216,"sheet_cells":100000,"rows_first":2000,"rows_last":500,"rows_between":2000,"halvings":0,"cell_chars":16384,"cell_head_chars":4096},"cells_cut":0,"cells_raw":0,"read":"whole","date_system":"1900"}

{"sheet":"Instructions","index":0,"n_rows":42,"n_cols":6,"rows_kept":42,"cut":false,"hidden":false,"merged":[[9,1,9,3],[9,5,9,13],[1,1,1,13],[3,1,3,13],[5,1,5,8],[8,1,8,3],[8,5,8,13],[16,1,16,3],[16,5,16,13],[10,1,10,3],[10,5,10,13],[11,1,11,3],[11,5,13,13],[12,1,12,3],[14,1,14,13],[15,1,15,3],[15,5,15,13],[23,1,23,3],[23,5,23,13],[17,1,17,3],[17,5,17,13],[18,1,18,3],[18,5,18,13],[19,1,19,3],[19,5,19,13],[20,1,20,3],[20,5,20,13],[21,1,21,3],[21,5,21,13],[22,1,22,13],[30,1,30,3],[30,5,30,13],[24,1,24,3],[24,5,24,13],[25,1,25,3],[25,5,25,13],[26,1,26,3],[26,5,26,13],[27,1,27,3],[27,5,27,13],[28,1,28,13],[29,1,29,3],[29,5,29,13],[31,1,31,3],[31,5,31,13],[32,1,32,3],[32,5,32,13],[33,1,33,3],[33,5,33,13],[41,1,42,14],[34,1,34,3],[34,5,34,13],[35,1,35,3],[35,5,35,13],[36,1,36,3],[36,5,36,13]]}
[]
[null,"HOW TO USE THE DYNAMIC TOTAL COST OF OWNERSHIP DASHBOARD"]
[]
[null,"All cells highlighted Green are Input cells. Values can only be edited in these cells to observe the dynamic changes in the dashboard on the right."]
[]
[null,"All cells highlighted Gray are Fixed cells. These values cannot be edited."]
[]
[]
[null,"CELL NAME",null,null,"FUNCTION","ACTION REQUIRED"]
[null,"Vehicle Holding Period (Year)",null,null,"Editable","Use the drop down menu on Cell C5 to choose the Vehicle holding period from 1 to 10 years "]
[null,"Daily Distance Travelled (km)",null,null,"Editable","Use the arrows on the right to increase/decrease to input Daily Distance Travelled in km"]
[null,"Daily Distance Travelled (mi)",null,null,"Fixed"]
[null,"Annual Distance Travelled (km)",null,null,"Fixed"]
[null,"Annual Distance Travelled (mi)",null,null,"Fixed"]
[]
{"$rows_left_out":28}
{"sheet":"2-Wheelers TCO Dashboard","index":1,"n_rows":74,"n_cols":47,"rows_kept":74,"cut":false,"hidden":false,"merged":[[2,1,2,3],[14,3,14,5],[16,2,16,5],[4,3,4,5]]}
[]
[null,null,null,null,null,null,null,null,null,null,null,null,null,null,null,null,null,null,null,null,null,null,null,null,null,null,null,null,null,null,null,null,null,null,null,null,null,null,null,"Dynamic","TCO",null,null,"e-2W (VRLA)","e-2W (LIB_SB)","e-2W (LIB_BB)","Petrol-2W"]
[null,null,null,null,null,null,null,null,null,null,null,null,null,null,null,null,null,null,null,null,null,null,null,null,null,null,null,null,null,null,null,null,null,null,null,null,null,null,null,"e-2W (VRLA)",{"$f":"VLOOKUP($C$5,$AQ$2:$AU$12,2,0)","v":1.5123334676397666},null,1,{"$f":"IF($C$5=AQ3,AR20:AU20,)","v":0}]
[null,null,null,null,null,null,null,null,null,null,null,null,null,null,null,null,null,null,null,null,null,null,null,null,null,null,null,null,null,null,null,null,null,null,null,null,null,null,null,"e-2W (LIB_SB)",{"$f":"VLOOKUP($C$5,$AQ$2:$AU$12,3,0)","v":1.2088799145706186},null,2,{"$f":"IF($C$5=AQ4,AR21:AU21,)","v":0}]
[null,"Vehicle Holding Period (Year)",5,"              Use Drop down to choose Holding Period",null,null,null,null,null,null,null,null,null,null,null,null,null,null,null,null,null,null,null,null,null,null,null,null,null,null,null,null,null,null,null,null,null,null,null,"e-2W (LIB_BB)",{"$f":"VLOOKUP($C$5,$AQ$2:$AU$12,4,0)","v":1.8634166978044915},null,3,{"$f":"IF($C$5=AQ5,AR22:AU22,)","v":0}]
[null,null,null,null,null,null,null,null,null,null,null,null,null,null,null,null,null,null,null,null,null,null,null,null,null,null,null,null,null,null,null,null,null,null,null,null,null,null,null,"Petrol-2W",{"$f":"VLOOKUP($C$5,$AQ$2:$AU$12,5,0)","v":2.8706016164965504},null,4,{"$f":"IF($C$5=AQ6,AR23:AU23,)","v":0}]
[null,"Daily Distance Travelled (km)",80,null,"(Use Arrows to input Distance)",null,null,null,null,null,null,null,null,null,null,null,null,null,null,null,null,null,null,null,null,null,null,null,null,null,null,null,null,null,null,null,null,null,null,null,null,null,5,{"$f":"IF($C$5=AQ7,AR24:AU24,)","v":1.5123334676397666},1.2088799145706186,1.8634166978044915,2.8706016164965504]
[null,"Daily Distance Travelled (mi)",{"$f":"C7*0.621371","v":49.709679999999999},null,null,null,null,null,null,null,null,null,null,null,null,null,null,null,null,null,null,null,null,null,null,null,null,null,null,null,null,null,null,null,null,null,null,null,null,"Year 10","TCO",null,6,{"$f":"IF($C$5=AQ8,AR25:AU25,)","v":0}]
[null,null,null,null,null,null,null,null,null,null,null,null,null,null,null,null,null,null,null,null,null,null,null,null,null,null,null,null,null,null,null,null,null,null,null,null,null,null,null,"e-2W (VRLA)",{"$f":"AR29","v":1.0930331893920329},null,7,{"$f":"IF($C$5=AQ9,AR26:AU26,)","v":0}]
[null,"Annual Distance Travelled (km)",{"$f":"C7*365","v":29200},null,null,null,null,null,null,null,null,null,null,null,null,null,null,null,null,null,null,null,null,null,null,null,null,null,null,null,null,null,null,null,null,null,null,null,null,"e-2W (LIB_SB)",{"$f":"AS29","v":0.81516213895316914},null,8,{"$f":"IF($C$5=AQ10,AR27:AU27,)","v":0}]
[null,"Annual Distance Travelled (mi)",{"$f":"C8*365","v":18144.033199999998},null,null,null,null,null,null,null,null,null,null,null,null,null,null,null,null,null,null,null,null,null,null,null,null,null,null,null,null,null,null,null,null,null,null,null,null,"e-2W (LIB_BB)",{"$f":"AT29","v":1.2488268747984046},null,9,{"$f":"IF($C$5=AQ11,AR28:AU28,)","v":0}]
[null,null,null,null,null,null,null,null,null,null,null,null,null,null,null,null,null,null,null,null,null,null,null,null,null,null,null,null,null,null,null,null,null,null,null,null,null,null,null,"Petrol-2W",{"$f":"AU29","v":2.1887615126390045},null,10,{"$f":"IF($C$5=AQ12,AR29:AU29,)","v":0}]
[]
[]
[null,null,"INR"]
{"$rows_left_out":60}
{"sheet":"Summary","index":2,"n_rows":30,"n_cols":5,"rows_kept":30,"cut":false,"hidden":false,"merged":[[0,0,0,1]]}
["TRAVEL DETAILS"]
["Number of Vehicle",1]
["Life of Vehicle (yrs)",10]
["Annual drive distance (KM)",{"$f":"'2-Wheelers TCO Dashboard'!C10","v":29200}]
["Total Distance Travel (KM)",{"$f":"B3*B4","v":292000}]
["LIB Cost (USD/kWh)",{"$f":"'2-Wheelers TCO Dashboard'!C41","v":137}]
["USD to INR",73]
["VRLA Cost (USD/kWh)",100]
["General Inputs","e-2W (VRLA)","e-2W (LIB_SB)","e-2W (LIB_BB)","Petrol-2W"]
["Discount rate (%)",{"$f":"'2-Wheelers TCO Dashboard'!C25","v":0.1},{"$f":"'2-Wheelers TCO Dashboard'!D25","v":0.1},{"$f":"'2-Wheelers TCO Dashboard'!E25","v":0.1},{"$f":"'2-Wheelers TCO Dashboard'!F25","v":0.1}]
["Resale rate (%)",{"$f":"'2-Wheelers TCO Dashboard'!C26","v":0.1},{"$f":"'2-Wheelers TCO Dashboard'!D26","v":0.15},{"$f":"'2-Wheelers TCO Dashboard'!E26","v":0.2},{"$f":"'2-Wheelers TCO Dashboard'!F26","v":0.1}]
[]
["Capital Cost","e-2W (VRLA)","e-2W (LIB_SB)","e-2W (LIB_BB)","Petrol-2W"]
["Total Vehicle Cost (₹)",{"$f":"'Capital Cost'!B8","v":87930.861270038848},{"$f":"'Capital Cost'!C8","v":118515.76104828341},{"$f":"'Capital Cost'!D8","v":206010.00560794678},{"$f":"'Capital Cost'!E8","v":91307.857903083437}]
["Resale Value (₹)",{"$f":"B14*B11","v":8793.0861270038858},{"$f":"C14*C11","v":17777.364157242511},{"$f":"D14*D11","v":41202.001121589361},{"$f":"E14*E11","v":9130.7857903083441}]
{"$rows_left_out":16}
{"sheet":"Currency","index":3,"n_rows":55,"n_cols":9,"rows_kept":55,"cut":false,"hidden":true,"merged":[[15,1,15,2],[1,1,1,3],[15,4,15,5],[15,7,15,8]]}
[]
[null,"CURRENCY CONVERSION"]
[]
[null,"USD","INR","Conversion"]
[null,1,74,{"$f":"B5*C5","v":74}]
[]
[null,"EURO","INR","Conversion"]
[null,1,82,{"$f":"B8*C8","v":82}]
[]
[]
[]
[]
[]
[]
[]
{"$rows_left_out":41}
{"sheet":"Capital Cost","index":4,"n_rows":42,"n_cols":7,"rows_kept":42,"cut":false,"hidden":true,"merged":[[23,0,23,4],[28,0,28,4],[33,0,33,4],[38,0,38,4]]}
["Vehicle Cost","e-2W (VRLA)","e-2W (LIB_SB)","e-2W (LIB_BB)","Petrol-2W",null,"USER INPUT"]
["Purchase Cost (₹)",{"$f":"VLOOKUP('2-Wheelers TCO Dashboard'!$C$15,'Capital Cost'!$A$25:$E$27,2,0)","v":59889},{"$f":"VLOOKUP('2-Wheelers TCO Dashboard'!$C$15,'Capital Cost'!$A$25:$E$27,3,0)","v":81998},{"$f":"VLOOKUP('2-Wheelers TCO Dashboard'!$C$15,'Capital Cost'!$A$25:$E$27,4,0)","v":142190},{"$f":"VLOOKUP('2-Wheelers TCO Dashboard'!$C$15,'Capital Cost'!$A$25:$E$27,5,0)","v":66271},null,"PREFIXED DATA"]
["Tax (₹)",{"$f":"VLOOKUP('2-Wheelers TCO Dashboard'!$C$15,'Capital Cost'!$A$30:$E$32,2,0)","v":4192},{"$f":"VLOOKUP('2-Wheelers TCO Dashboard'!$C$15,'Capital Cost'!$A$30:$E$32,3,0)","v":4549},{"$f":"VLOOKUP('2-Wheelers TCO Dashboard'!$C$15,'Capital Cost'!$A$30:$E$32,4,0)","v":9055},{"$f":"VLOOKUP('2-Wheelers TCO Dashboard'!$C$15,'Capital Cost'!$A$30:$E$32,5,0)","v":4638},null,"CALCULATION"]
["Insurance (₹)",{"$f":"VLOOKUP('2-Wheelers TCO Dashboard'!$C$15,'Capital Cost'!$A$35:$E$37,2,0)","v":1593},{"$f":"VLOOKUP('2-Wheelers TCO Dashboard'!$C$15,'Capital Cost'!$A$35:$E$37,3,0)","v":1680},{"$f":"VLOOKUP('2-Wheelers TCO Dashboard'!$C$15,'Capital Cost'!$A$35:$E$37,4,0)","v":2505},{"$f":"VLOOKUP('2-Wheelers TCO Dashboard'!$C$15,'Capital Cost'!$A$35:$E$37,5,0)","v":4418},null,"LINKED CELL"]
["Financing Component (₹)",{"$f":"Financing!B17","v":22256.86127003884},{"$f":"Financing!C17","v":30288.761048283413},{"$f":"Financing!D17","v":52260.005607946776},{"$f":"Financing!E17","v":15980.857903083444}]
["Total Financial Incentive (₹)",{"$f":"VLOOKUP('2-Wheelers TCO Dashboard'!$C$15,'Capital Cost'!$A$40:$E$42,2,0)","v":0},0,0,{"$f":"VLOOKUP('2-Wheelers TCO Dashboard'!$C$15,'Capital Cost'!$A$40:$E$42,5,0)","v":0}]
["Misc. Cost (₹)",0,0,0,0]
["Total Vehicle Cost (₹)",{"$f":"((B2+B3+B4+B5+B7)-B6)","v":87930.861270038848},{"$f":"((C2+C3+C4+C5+C7)-C6)","v":118515.76104828341},{"$f":"((D2+D3+D4+D5+D7)-D6)","v":206010.00560794678},{"$f":"((E2+E3+E4+E5+E7)-E6)","v":91307.857903083437}]
[]
["Charging Infrastructure Cost","e-2W (VRLA)","e-2W (LIB_SB)","e-2W (LIB_BB)","Petrol-2W"]
["No. of Slow Charger (SC)",{"$f":"'2-Wheelers TCO Dashboard'!#REF!","v":{"$error":"#REF!"}},{"$f":"'2-Wheelers TCO Dashboard'!#REF!","v":{"$error":"#REF!"}},{"$f":"'2-Wheelers TCO Dashboard'!#REF!","v":{"$error":"#REF!"}},{"$f":"'2-Wheelers TCO Dashboard'!#REF!","v":{"$error":"#REF!"}}]
["Cost of SC per unit (₹)",0,0,0,0]
["Total Cost of SC (₹)",{"$f":"B11*B12","v":{"$error":"#REF!"}},{"$f":"C11*C12","v":{"$error":"#REF!"}},{"$f":"D11*D12","v":{"$error":"#REF!"}},0]
["No. of Fast Charger (FC)",{"$f":"'2-Wheelers TCO Dashboard'!#REF!","v":{"$error":"#REF!"}},{"$f":"'2-Wheelers TCO Dashboard'!#REF!","v":{"$error":"#REF!"}},{"$f":"'2-Wheelers TCO Dashboard'!#REF!","v":{"$error":"#REF!"}},{"$f":"'2-Wheelers TCO Dashboard'!#REF!","v":{"$error":"#REF!"}}]
["Cost of FC per unit (₹)",0,0,0,0]
{"$rows_left_out":28}
{"sheet":"Financing","index":5,"n_rows":24,"n_cols":5,"rows_kept":24,"cut":false,"hidden":true,"merged":[[20,0,20,4],[25,0,25,4]]}
["Vehicle Cost","e-2W (VRLA)","e-2W (LIB_SB)","e-2W (LIB_BB)","Petrol-2W"]
["Total Cost of 2W (₹)",{"$f":"'2-Wheelers TCO Dashboard'!C20-'2-Wheelers TCO Dashboard'!C23","v":59889},{"$f":"'2-Wheelers TCO Dashboard'!D20-'2-Wheelers TCO Dashboard'!D23","v":81998},{"$f":"'2-Wheelers TCO Dashboard'!E20-'2-Wheelers TCO Dashboard'!E23","v":142190},{"$f":"'2-Wheelers TCO Dashboard'!F20","v":66271}]
["Share of Operator (%)",{"$f":"100%-B6","v":0.85},{"$f":"100%-C6","v":0.85},{"$f":"100%-D6","v":0.85},{"$f":"100%-E6","v":0.85}]
["Share of Operator (₹)",{"$f":"B3*B2","v":50905.65},{"$f":"C3*C2","v":69698.3},{"$f":"D3*D2","v":120861.5},{"$f":"E3*E2","v":56330.35}]
["Processing  Fees",{"$f":"IF(B8=0,0,IF(B4*0.5%>500,B4*0.5%,500))","v":500},{"$f":"IF(C8=0,0,IF(C4*0.5%>500,C4*0.5%,500))","v":500},{"$f":"IF(D8=0,0,IF(D4*0.5%>500,D4*0.5%,500))","v":604.3075},{"$f":"IF(E8=0,0,IF(E4*0.5%>500,E4*0.5%,500))","v":500}]
["Equity %",{"$f":"'2-Wheelers TCO Dashboard'!C31","v":0.15},{"$f":"'2-Wheelers TCO Dashboard'!D31","v":0.15},{"$f":"'2-Wheelers TCO Dashboard'!E31","v":0.15},{"$f":"'2-Wheelers TCO Dashboard'!F31","v":0.15}]
["Equity (₹)",{"$f":"(B6*B2)","v":8983.35},{"$f":"(C6*C2)","v":12299.699999999999},{"$f":"(D6*D2)","v":21328.5},{"$f":"(E6*E2)","v":9940.65}]
["Loan amount (₹)",{"$f":"B4","v":50905.65},{"$f":"C4","v":69698.3},{"$f":"D4","v":120861.5},{"$f":"E4","v":56330.35}]
["Interest rate (%)",{"$f":"'2-Wheelers TCO Dashboard'!C30","v":0.15},{"$f":"'2-Wheelers TCO Dashboard'!D30","v":0.15},{"$f":"'2-Wheelers TCO Dashboard'!E30","v":0.15},{"$f":"'2-Wheelers TCO Dashboard'!F30","v":0.1}]
["Term of payment (yrs)",{"$f":"'2-Wheelers TCO Dashboard'!C29","v":5},{"$f":"'2-Wheelers TCO Dashboard'!D29","v":5},{"$f":"'2-Wheelers TCO Dashboard'!E29","v":5},{"$f":"'2-Wheelers TCO Dashboard'!F29","v":5}]
["No of EMI (Yearly)",{"$f":"B10*12","v":60},{"$f":"C10*12","v":60},60,60]
["Monthly EMI Loan (Rs.)",{"$f":"((PMT(B9/12,B10*12,-B8))+(B5/B11))","v":1219.3751878339808},{"$f":"((PMT(C9/12,C10*12,-C8))+(C5/C11))","v":1666.4510174713901},{"$f":"((PMT(D9/12,D10*12,-D8))+(D5/D11))","v":2885.3584267991127},{"$f":"((PMT(E9/12,E10*12,-E8))+(E5/E11))","v":1205.1867983847242}]
["Total interest paid",{"$f":"(B12*B10*12)-B8","v":22256.86127003884},{"$f":"(C12*C10*12)-C8","v":30288.761048283413},{"$f":"(D12*D10*12)-D8","v":52260.005607946776},{"$f":"(E12*E10*12)-E8","v":15980.857903083444}]
["Yearly Interest Paid",{"$f":"B13/B10","v":4451.3722540077679},{"$f":"C13/C10","v":6057.7522096566827},{"$f":"D13/D10","v":10452.001121589356},{"$f":"E13/E10","v":3196.171580616689}]
["EMI per KM (Rs.)",{"$f":"B14/Summary!$B$4","v":0.15244425527423863},{"$f":"C14/Summary!$B$4","v":0.20745726745399598},{"$f":"D14/Summary!$B$4","v":0.35794524389004645},{"$f":"E14/Summary!$B$4","v":0.10945793084303729}]
{"$rows_left_out":10}
{"sheet":"Operational Cost","index":6,"n_rows":47,"n_cols":7,"rows_kept":47,"cut":false,"hidden":true,"merged":[[33,0,33,4],[38,0,38,4],[43,0,43,4]]}
["Staff cost","e-2W (VRLA)","e-2W (LIB_SB)","e-2W (LIB_BB)","Petrol-2W",null,"USER INPUT"]
["Staff Cost (₹ / Month)",{"$f":"VLOOKUP('2-Wheelers TCO Dashboard'!$C$15,'Operational Cost'!$A$35:$B$37,2,0)","v":0},{"$f":"VLOOKUP('2-Wheelers TCO Dashboard'!$C$15,'Operational Cost'!$A$35:$B$37,2,0)","v":0},{"$f":"VLOOKUP('2-Wheelers TCO Dashboard'!$C$15,'Operational Cost'!$A$35:$B$37,2,0)","v":0},{"$f":"VLOOKUP('2-Wheelers TCO Dashboard'!$C$15,'Operational Cost'!$A$35:$B$37,2,0)","v":0},null,"PREFIXED DATA"]
["Other Support staff cost (₹ / Month)",0,0,0,0,null,"CALCULATION"]
["Total Annual Staff Cost (₹)",{"$f":"((B2+B3)*12)","v":0},{"$f":"((C2+C3)*12)","v":0},{"$f":"((D2+D3)*12)","v":0},{"$f":"((E2+E3)*12)","v":0},null,"LINKED CELL"]
["Per km Staff Cost",{"$f":"B4/Summary!$B$4","v":0},{"$f":"C4/Summary!$B$4","v":0},{"$f":"D4/Summary!$B$4","v":0},{"$f":"E4/Summary!$B$4","v":0}]
[]
["Average Fuel Cost","e-2W (VRLA)","e-2W (LIB_SB)","e-2W (LIB_BB)","Petrol-2W"]
["Fuel cost (₹/kWh; ₹/L or $/gal)",{"$f":"VLOOKUP('2-Wheelers TCO Dashboard'!$C$15,'Operational Cost'!$A$45:$E$47,2,0)","v":6},{"$f":"VLOOKUP('2-Wheelers TCO Dashboard'!$C$15,'Operational Cost'!$A$45:$E$47,3,0)","v":6},{"$f":"VLOOKUP('2-Wheelers TCO Dashboard'!$C$15,'Operational Cost'!$A$45:$E$47,4,0)","v":6},{"$f":"VLOOKUP('2-Wheelers TCO Dashboard'!$C$15,'Operational Cost'!$A$45:$E$47,5,0)","v":100}]
["Mileage (km/kWh; km/L)",{"$f":"'2-Wheelers TCO Dashboard'!C47","v":52},{"$f":"'2-Wheelers TCO Dashboard'!D47","v":57},{"$f":"'2-Wheelers TCO Dashboard'!E47","v":59},{"$f":"'2-Wheelers TCO Dashboard'!F47","v":38}]
["Annual fuel consumption (kWh; L)",{"$f":"Summary!B4/B9","v":561.53846153846155},{"$f":"Summary!B4/C9","v":512.28070175438597},{"$f":"Summary!B4/D9","v":494.91525423728814},{"$f":"Summary!$B$4/E9","v":768.42105263157896}]
["Total Annual Fuel Cost ( ₹ )",{"$f":"(B10*B8)","v":3369.2307692307695},{"$f":"(C10*C8)","v":3073.6842105263158},{"$f":"(D10*D8)","v":2969.4915254237289},{"$f":"(E10*E8)","v":76842.105263157893}]
["Per km Fuel Cost",{"$f":"B11/Summary!$B$4","v":0.11538461538461539},{"$f":"C11/Summary!$B$4","v":0.10526315789473685},{"$f":"D11/Summary!$B$4","v":0.10169491525423729},{"$f":"E11/Summary!$B$4","v":2.6315789473684208}]
[]
["Maintenance Cost","e-2W (VRLA)","e-2W (LIB_SB)","e-2W (LIB_BB)","Petrol-2W"]
["Annual Maintenance Cost (₹)",{"$f":"'2-Wheelers TCO Dashboard'!C48","v":1250},{"$f":"'2-Wheelers TCO Dashboard'!D48","v":1200},{"$f":"'2-Wheelers TCO Dashboard'!E48","v":1200},{"$f":"'2-Wheelers TCO Dashboard'!F48","v":2546}]
{"$rows_left_out":33}
{"sheet":"TCO_1","index":7,"n_rows":45,"n_cols":13,"rows_kept":45,"cut":false,"hidden":true,"merged":[]}
["Parameter","Unit","e-2W (VRLA)","e-2W (LIB_SB)","e-2W (LIB_BB)","Petrol-2W"]
["Discount rate value","-",{"$f":"Summary!B10","v":0.1},{"$f":"Summary!C10","v":0.1},{"$f":"Summary!D10","v":0.1},{"$f":"Summary!E10","v":0.1}]
["Resale rate value","-",{"$f":"Summary!B11","v":0.1},{"$f":"Summary!C11","v":0.15},{"$f":"Summary!D11","v":0.2},{"$f":"Summary!E11","v":0.1}]
["Capital recovery factor (CRF)_N","-",{"$f":"C2*(1+C2)^Summary!B3","v":0.2593742460100002},{"$f":"D2*(1+D2)^Summary!B3","v":0.2593742460100002},{"$f":"E2*(1+E2)^Summary!B3","v":0.2593742460100002},{"$f":"F2*(1+F2)^Summary!B3","v":0.2593742460100002}]
["Capital recovery factor (CRF)_D","-",{"$f":"((1+C2)^Summary!B3)-1","v":1.5937424601000019},{"$f":"(1+D2)^Summary!B3-1","v":1.5937424601000019},{"$f":"(1+E2)^Summary!B3-1","v":1.5937424601000019},{"$f":"(1+F2)^Summary!B3-1","v":1.5937424601000019}]
["CRF","-",{"$f":"C4/C5","v":0.16274539488251155},{"$f":"D4/D5","v":0.16274539488251155},{"$f":"E4/E5","v":0.16274539488251155},{"$f":"F4/F5","v":0.16274539488251155}]
["Present value factor (PVF)","-",{"$f":"1/(1+C2)^10","v":0.38554328942953148},{"$f":"1/(1+D2)^Summary!B3","v":0.38554328942953148},{"$f":"1/(1+E2)^Summary!B3","v":0.38554328942953148},{"$f":"1/(1+F2)^Summary!B3","v":0.38554328942953148}]
["Residual value (RV)","₹",{"$f":"Summary!B14*C3","v":8793.0861270038858},{"$f":"Summary!C14*D3","v":17777.364157242511},{"$f":"Summary!D14*E3","v":41202.001121589361},{"$f":"Summary!E14*F3","v":9130.7857903083441}]
["Annual  Travel Distance","km",{"$f":"Summary!$B$4","v":29200},{"$f":"Summary!$B$4","v":29200},{"$f":"Summary!$B$4","v":29200},{"$f":"Summary!$B$4","v":29200}]
["Capex component","₹",{"$f":"((Summary!B19-(C8*C7))*C6)","v":13758.61707847702},{"$f":"(Summary!C19-(D8*D7))*D6","v":18172.446597587877},{"$f":"(Summary!D19-(E8*E7))*E6","v":30941.943882089909},{"$f":"(Summary!E19-(F8*F7))*F6","v":14287.018630313045}]
["TCO","₹/km",{"$f":"(C10+L22)/C9","v":1.0930331893920329},{"$f":"(D10+L23)/D9","v":0.81516213895316914},{"$f":"(E10+L24)/E9","v":1.2488268747984046},{"$f":"(F10+L25)/F9","v":2.1887615126390045}]
[]
["Opex / year"]
["Vehicle type","Unit",1,{"$f":"C14+1","v":2},3,4,5,6,7,8,9,10,"Total"]
["e-2W (VRLA)","₹",{"$f":"Summary!$B$27/(1+$C$2)^C14","v":26864.755244755244},{"$f":"Summary!$B$27/(1+$C$2)^D14","v":24422.504767959308},{"$f":"Summary!$B$27/(1+$C$2)^E14","v":22202.277061781188},{"$f":"Summary!$B$27/(1+$C$2)^F14","v":20183.888237982897},{"$f":"Summary!$B$27/(1+$C$2)^G14","v":18348.989307257179},{"$f":"Summary!$B$27/(1+$C$2)^H14","v":16680.899370233798},{"$f":"Summary!$B$27/(1+$C$2)^I14","v":15164.453972939813},{"$f":"Summary!$B$27/(1+$C$2)^J14","v":13785.867248127104},{"$f":"Summary!$B$27/(1+$C$2)^K14","v":12532.606589206458},{"$f":"Summary!$B$27/(1+$C$2)^L14","v":11393.278717460415},{"$f":"SUM(C15:L15)/Summary!B3","v":18157.952051770339}]
{"$rows_left_out":31}
{"sheet":"References","index":8,"n_rows":39,"n_cols":14,"rows_kept":39,"cut":false,"hidden":true,"merged":[]}
[]
[null,"Assumption",null,null,null,"Source"]
[1,"Life of Vehicle",null,null,null,"Assumed"]
[2,"Annual driving distance",null,null,null,"Base case assumption = 5000 km per year"]
[3,"Total distance travelled",null,null,null,"Assumed"]
[4,"LIB cost",null,null,null,"https://bnef.turtl.co/story/evo2018?teaser=true ",null,null,null,null,"BNEF EV Outlook 2018 ($200/kWh)"]
[5,"Pb-Acid battery cost",null,null,null,"https://www.engineering.com/ElectronicsDesign/ElectronicsDesignArticles/ArticleID/17776/NantEnergys-Zinc-Air-Battery-Crosses-the-100kWh-Barrier.aspx"]
[6,"Discount rate",null,null,null,"Assumed"]
[7,"Resale value",null,null,null,"Assumed"]
[8,"Purchase cost (VRLA)",null,null,null,"https://auto.ndtv.com/okinawa-bikes/praise"]
[9,"Purchase cost (LIB_SB)",null,null,null,"https://auto.ndtv.com/okinawa-bikes/ridge-plus"]
[10,"Purchase cost (LIB_BB)",null,null,null,"https://auto.ndtv.com/ather-bikes/450"]
[11,"Purchase cost (Petrol)",null,null,null,"https://auto.ndtv.com/honda-bikes/activa-125 "]
[12,"Tax (VRLA)",null,null,null,"https://auto.ndtv.com/okinawa-bikes/praise"]
[13,"Tax (LIB_SB)",null,null,null,"https://auto.ndtv.com/okinawa-bikes/ridge-plus"]
{"$rows_left_out":25}
{"sheet":"Tech. Specs.","index":9,"n_rows":11,"n_cols":6,"rows_kept":11,"cut":false,"hidden":true,"merged":[]}
[]
[]
[null,"Specifications","Okinawa Praise","Okinawa Ridge Plus","Ather 450","Honda Activa 125"]
[null,"Engine","BLDC Motor","BLDC Motor","BLDC Motor","124.9 CC"]
[null,"Max Speed","75 kmph","55 kmph","80 kmph"]
[null,"Rated Power","1000 Watt","800 Watt","5.4 kW"]
[null,"Battery Type","VRLA","Li-ion","Li-ion"]
[null,"Battery Capacity","3.24 kWh","1.75 kWh","2.4 kWh Lithium-ion "]
[null,"Battery Range","170 Km/charge","100 km/charge","75 km/charge"]
[null,"Charging Time","6-8 hrs","2-3 hrs","2 - 2.5 hrs"]
[null,"Cycle life (Battery)"]